{"text_format":"1","workbook":"xlsx","n_sheets":11,"sheets":["Instructions & Notes","FormB_CPP_OA","FormA_CPP_OA_Q1","FormA_CPP_OA_Q2","FormA_CPP_OA_Q3","FormA_CPP_OA_Q4","Supporting Sheet","Annexure-1","Annexure-2","StateUTs","Targets"],"not_rendered":{"charts":0,"images":4,"macros":1,"external_links":66,"defined_names":2833,"comments":0,"pivot_tables":0},"unopened":[],"bounds":{"document_bytes":16777216,"sheet_cells":100000,"rows_first":2000,"rows_last":500,"rows_between":2000,"halvings":0,"cell_chars":16384,"cell_head_chars":4096},"cells_cut":0,"cells_raw":0,"read":"whole","date_system":"1900"}

{"sheet":"Instructions & Notes","index":0,"n_rows":11,"n_cols":3,"rows_kept":11,"cut":false,"hidden":false,"merged":[[1,1,1,2],[2,1,2,2]]}
[]
[null,"RCO Compliance Data reporting by DCs with CPP & Open Access "]
[null,"Important Instructions and Notes:"]
[null,1,"This excel workbook contains the following worksheets:\n●  Form B (Worksheet name \"FormB_CPP_OA\") - The Annual Energy Consumption Details will appear in this worksheet\n●  Form A (Four Worksheets named \"FormA_CPP_OA_Q1\" to \"FormA_CPP_OA_Q4\") - The Quarterly Energy Consumption Details are to be entered in this sheet\n●  Annexure-1 (Worksheet name \"Annexure-1\") - This sheet is to be used only in case of co-firing of renewable fuels in CPPs or as part of other Industrial Processes. The sheet estimates the RE generated from such combustion of renewable fuels.\n●  Annexure-2 (Worksheet name \"Annexure-2\") - This sheet is to used only in case of consumption of Green Hydrogen. The sheet estimates the electrical energy equivalent of Green Hydrogen consumed."]
[null,2,"Name, Address and other basic details of Obligated Designated Consumers to be entered in Form B (in Worksheet named \"FormB_CPP_OA\"). These details will be populated automatically in other sheets based on input in Form B"]
[null,3,"Renewable Consumption Obligations (%Target) specified by MoP will be auto-populated in the Form B and all Form As, once the Target Year (i.e. the financial year for which RCO Compliance is being evaluated) and Location (State) of the Designated Consumer is entered in Form B (in Worksheet named \"FormB_CPP_OA\")."]
[null,4,"Electrical Energy Consumption is to be entered in Million Units (MU) throughout all worksheets in this workbook. "]
[null,5,"Total Energy Consumption and Non-fossil Energy Consumption details to be entered in Form A for each of the respective Quarters (in Worksheets named \"FormA_CPP_OA_Q1\" to \"FormA_CPP_OA_Q4\"). Annual details will be populated from these sheets into Form B"]
[null,6,"Please refer carefully to the Legend and Notes provided on each worksheet while filling in the details"]
[null,7,"In case of co-firing of Renewable Fuels in Captive Power Plants, the quarter wise details are to be filled in the Worksheet named \"Annexure-1\". Calculations will be done in the worksheet and results will be populated in Form A for the respective quarter"]
[null,8,"In case of consumption of Green Hydrogen, the quarter wise details are to be filled in the Worksheet named \"Annexure-2\". Calculations will be done in the worksheet and results will be populated in Form A for the respective quarter"]

{"sheet":"FormB_CPP_OA","index":1,"n_rows":55,"n_cols":5,"rows_kept":55,"cut":false,"hidden":false,"merged":[[16,1,16,4],[1,1,1,4],[10,1,10,4],[7,2,7,4],[8,2,8,4],[2,2,2,4],[3,2,3,4],[4,2,4,4],[5,2,5,4],[6,2,6,4],[44,1,44,4],[22,1,22,4],[45,1,45,4],[46,1,46,4],[49,1,49,4],[47,1,47,4],[34,1,34,4],[43,1,43,4]]}
[]
[null,"ANNUAL RCO COMPLIANCE DECLARATION FORM (FORM B) - DCs with CPP & Open Access"]
[null,"Name of Obligated Designated Consumer"]
[null,"Address"]
[null,"Registration No. of Obligated Designated Consumer"]
[null,"Type of obligation(s) of Obligated Designated Consumer#"]
[null,"Target Year FY (__-__)"]
[null,"Location (State)"]
[null,"State Category",{"$f":"IF(ISBLANK(C8),\"\",VLOOKUP(C8,StateUTs!$B$2:$C$37,2))","v":""}]
[null,"Particulars","Nomenclature","Unit","Total Energy"]
[null,"Part A! – Gross Total Energy Consumption (Fossil based + Non-fossil based)"]
[null,"Gross Total Energy Consumption for Quarter 1","A","MU",{"$f":"FormA_CPP_OA_Q1!E35","v":0}]
[null,"Gross Total Energy Consumption for Quarter 2","B","MU",{"$f":"FormA_CPP_OA_Q2!E35","v":0}]
[null,"Gross Total Energy Consumption for Quarter 3","C","MU",{"$f":"FormA_CPP_OA_Q3!E35","v":0}]
[null,"Gross Total Energy Consumption for Quarter 4","D","MU",{"$f":"FormA_CPP_OA_Q4!E35","v":0}]
[null,"Gross Total Energy Consumption for Target Financial Year","E = A+B+C+D","MU",{"$f":"SUM(E12:E15)","v":0}]
[null,"Part B! – Gross Non-fossil based Energy Consumption "]
[null,"Gross Non-fossil Energy Consumption for Quarter 1","F","MU",{"$f":"FormA_CPP_OA_Q1!E67","v":0}]
[null,"Gross Non-fossil Energy Consumption for Quarter 2","G","MU",{"$f":"FormA_CPP_OA_Q2!E67","v":0}]
[null,"Gross Non-fossil Energy Consumption for Quarter 3","H","MU",{"$f":"FormA_CPP_OA_Q3!E67","v":0}]
{"$rows_left_out":36}
{"sheet":"FormA_CPP_OA_Q1","index":2,"n_rows":104,"n_cols":5,"rows_kept":104,"cut":false,"hidden":false,"merged":[[98,1,98,4],[72,1,72,4],[1,1,1,4],[2,2,2,4],[3,2,3,4],[4,2,4,4],[5,2,5,4],[6,2,6,4],[8,2,8,4],[9,2,9,4],[10,1,10,4],[35,1,35,4],[7,2,7,4],[97,1,97,4],[90,1,90,4],[96,1,96,4],[95,1,95,4],[82,1,82,4],[85,1,85,4],[81,1,81,4],[87,1,87,4],[89,1,89,4],[88,1,88,4],[91,1,91,4],[83,1,83,4],[84,1,84,4],[92,1,92,4],[93,1,93,4],[94,1,94,4],[86,1,86,4]]}
[]
[null,"Quarterly RCO Compliance Data reporting (Form A) - DCs with CPP & Open Access "]
[null,"Name of Obligated Designated Consumer",{"$f":"FormB_CPP_OA!C3","v":0}]
[null,"Address",{"$f":"FormB_CPP_OA!C4","v":0}]
[null,"Registration No. of Obligated Designated Consumer",{"$f":"FormB_CPP_OA!C5","v":0}]
[null,"Type of obligation(s) of Obligated Designated Consumer#",{"$f":"FormB_CPP_OA!C6","v":0}]
[null,"Target Year FY (__-__)",{"$f":"FormB_CPP_OA!C7","v":0}]
[null,"Quarter","Quarter 1 (01 April to 30 June)"]
[null,"Location - State",{"$f":"FormB_CPP_OA!C8","v":0}]
[null,"State Category",{"$f":"FormB_CPP_OA!C9","v":""}]
[null,"Part A – Gross Total Energy Consumption (Fossil based + Non-fossil based)"]
[null,"Particulars ","Nomenclature","Unit","Total Energy"]
[null,"Own Generation, Net after deducting APC*** (Sub-Total)","AT=A+A!-A**+B+T","MU",{"$f":"E14+E15-E16+E17+E18","v":0}]
[null,"Total Fossil based energy generation *","A","MU"]
[null,"Ex-Bus Energy generation from Fossil based Auxiliary Firing in WHR System !!","A!","MU",{"$f":"'Annexure-1'!F46","v":0}]
[null,"Fossil based energy from WHR **","A**","MU"]
[null,"Nuclear energy","B","MU"]
[null,"Total RE ","T","MU",{"$f":"E47","v":0}]
[null,"Energy Purchase (Sub-Total)","CT=C+E+D+A'","MU",{"$f":"SUM(E20:E23)","v":0}]
[null,"Fossil based energy (PPA/Bilateral)","C","MU"]
{"$rows_left_out":85}
{"sheet":"FormA_CPP_OA_Q2","index":3,"n_rows":105,"n_cols":5,"rows_kept":105,"cut":false,"hidden":false,"merged":[[97,1,97,4],[99,1,99,4],[96,1,96,4],[94,1,94,4],[90,1,90,4],[89,1,89,4],[92,1,92,4],[95,1,95,4],[81,1,81,4],[83,1,83,4],[84,1,84,4],[87,1,87,4],[93,1,93,4],[91,1,91,4],[88,1,88,4],[82,1,82,4],[85,1,85,4],[86,1,86,4],[72,1,72,4],[1,1,1,4],[2,2,2,4],[3,2,3,4],[4,2,4,4],[5,2,5,4],[6,2,6,4],[10,1,10,4],[35,1,35,4],[7,2,7,4],[8,2,8,4],[9,2,9,4]]}
[]
[null,"Quarterly RCO Compliance Data reporting (Form A) - DCs with CPP & Open Access "]
[null,"Name of Obligated Designated Consumer",{"$f":"FormB_CPP_OA!C3","v":0}]
[null,"Address",{"$f":"FormB_CPP_OA!C4","v":0}]
[null,"Registration No. of Obligated Designated Consumer",{"$f":"FormB_CPP_OA!C5","v":0}]
[null,"Type of obligation(s) of Obligated Designated Consumer#",{"$f":"FormB_CPP_OA!C6","v":0}]
[null,"Target Year FY (__-__)",{"$f":"FormB_CPP_OA!C7","v":0}]
[null,"Quarter","Quarter 2 (01 July to 30 September)"]
[null,"Location - State",{"$f":"FormB_CPP_OA!C8","v":0}]
[null,"State Category",{"$f":"FormB_CPP_OA!C9","v":""}]
[null,"Part A – Gross Total Energy Consumption (Fossil based + Non-fossil based)"]
[null,"Particulars ","Nomenclature","Unit","Total Energy"]
[null,"Own Generation, Net after deducting APC*** (Sub-Total)","AT=A+A!-A**+B+T","MU",{"$f":"E14+E15-E16+E17+E18","v":0}]
[null,"Total Fossil based energy generation *","A","MU"]
[null,"Ex-Bus Energy generation from Fossil based Auxiliary Firing in WHR System !!","A!","MU",{"$f":"'Annexure-1'!G46","v":0}]
[null,"Fossil based energy from WHR **","A**","MU"]
[null,"Nuclear energy","B","MU"]
[null,"Total RE ","T","MU",{"$f":"E47","v":0}]
[null,"Energy Purchase (Sub-Total)","CT=C+E+D+A'","MU",{"$f":"SUM(E20:E23)","v":0}]
[null,"Fossil based energy (PPA/Bilateral)","C","MU"]
{"$rows_left_out":86}
{"sheet":"FormA_CPP_OA_Q3","index":4,"n_rows":105,"n_cols":5,"rows_kept":105,"cut":false,"hidden":false,"merged":[[97,1,97,4],[99,1,99,4],[96,1,96,4],[94,1,94,4],[90,1,90,4],[89,1,89,4],[92,1,92,4],[95,1,95,4],[81,1,81,4],[83,1,83,4],[84,1,84,4],[87,1,87,4],[93,1,93,4],[91,1,91,4],[88,1,88,4],[82,1,82,4],[85,1,85,4],[86,1,86,4],[72,1,72,4],[1,1,1,4],[2,2,2,4],[3,2,3,4],[4,2,4,4],[5,2,5,4],[6,2,6,4],[10,1,10,4],[35,1,35,4],[7,2,7,4],[8,2,8,4],[9,2,9,4]]}
[]
[null,"Quarterly RCO Compliance Data reporting (Form A) - DCs with CPP & Open Access "]
[null,"Name of Obligated Designated Consumer",{"$f":"FormB_CPP_OA!C3","v":0}]
[null,"Address",{"$f":"FormB_CPP_OA!C4","v":0}]
[null,"Registration No. of Obligated Designated Consumer",{"$f":"FormB_CPP_OA!C5","v":0}]
[null,"Type of obligation(s) of Obligated Designated Consumer#",{"$f":"FormB_CPP_OA!C6","v":0}]
[null,"Target Year FY (__-__)",{"$f":"FormB_CPP_OA!C7","v":0}]
[null,"Quarter","Quarter 3 (01 October to 31 December)"]
[null,"Location - State",{"$f":"FormB_CPP_OA!C8","v":0}]
[null,"State Category",{"$f":"FormB_CPP_OA!C9","v":""}]
[null,"Part A – Gross Total Energy Consumption (Fossil based + Non-fossil based)"]
[null,"Particulars ","Nomenclature","Unit","Total Energy"]
[null,"Own Generation, Net after deducting APC*** (Sub-Total)","AT=A+A!-A**+B+T","MU",{"$f":"E14+E15-E16+E17+E18","v":0}]
[null,"Total Fossil based energy generation *","A","MU"]
[null,"Ex-Bus Energy generation from Fossil based Auxiliary Firing in WHR System !!","A!","MU",{"$f":"'Annexure-1'!H46","v":0}]
[null,"Fossil based energy from WHR **","A**","MU"]
[null,"Nuclear energy","B","MU"]
[null,"Total RE ","T","MU",{"$f":"E47","v":0}]
[null,"Energy Purchase (Sub-Total)","CT=C+E+D+A'","MU",{"$f":"SUM(E20:E23)","v":0}]
[null,"Fossil based energy (PPA/Bilateral)","C","MU"]
{"$rows_left_out":86}
{"sheet":"FormA_CPP_OA_Q4","index":5,"n_rows":105,"n_cols":5,"rows_kept":105,"cut":false,"hidden":false,"merged":[[97,1,97,4],[99,1,99,4],[96,1,96,4],[94,1,94,4],[90,1,90,4],[89,1,89,4],[92,1,92,4],[95,1,95,4],[81,1,81,4],[83,1,83,4],[84,1,84,4],[87,1,87,4],[93,1,93,4],[91,1,91,4],[82,1,82,4],[88,1,88,4],[85,1,85,4],[86,1,86,4],[72,1,72,4],[1,1,1,4],[2,2,2,4],[3,2,3,4],[4,2,4,4],[5,2,5,4],[6,2,6,4],[10,1,10,4],[35,1,35,4],[7,2,7,4],[8,2,8,4],[9,2,9,4]]}
[]
[null,"Quarterly RCO Compliance Data reporting (Form A) - DCs with CPP & Open Access "]
[null,"Name of Obligated Designated Consumer",{"$f":"FormB_CPP_OA!C3","v":0}]
[null,"Address",{"$f":"FormB_CPP_OA!C4","v":0}]
[null,"Registration No. of Obligated Designated Consumer",{"$f":"FormB_CPP_OA!C5","v":0}]
[null,"Type of obligation(s) of Obligated Designated Consumer#",{"$f":"FormB_CPP_OA!C6","v":0}]
[null,"Target Year FY (__-__)",{"$f":"FormB_CPP_OA!C7","v":0}]
[null,"Quarter","Quarter 4 (01 January to 31 March)"]
[null,"Location - State",{"$f":"FormB_CPP_OA!C8","v":0}]
[null,"State Category",{"$f":"FormB_CPP_OA!C9","v":""}]
[null,"Part A – Gross Total Energy Consumption (Fossil based + Non-fossil based)"]
[null,"Particulars ","Nomenclature","Unit","Total Energy"]
[null,"Own Generation, Net after deducting APC*** (Sub-Total)","AT=A+A!-A**+B+T","MU",{"$f":"E14+E15-E16+E17+E18","v":0}]
[null,"Total Fossil based energy generation *","A","MU"]
[null,"Ex-Bus Energy generation from Fossil based Auxiliary Firing in WHR System !!","A!","MU",{"$f":"'Annexure-1'!I46","v":0}]
[null,"Fossil based energy from WHR **","A**","MU"]
[null,"Nuclear energy","B","MU"]
[null,"Total RE ","T","MU",{"$f":"E47","v":0}]
[null,"Energy Purchase (Sub-Total)","CT=C+E+D+A'","MU",{"$f":"SUM(E20:E23)","v":0}]
[null,"Fossil based energy (PPA/Bilateral)","C","MU"]
{"$rows_left_out":86}
{"sheet":"Supporting Sheet","index":6,"n_rows":23,"n_cols":14,"rows_kept":23,"cut":false,"hidden":true,"merged":[[13,9,14,9],[7,9,8,9],[9,9,10,9],[11,9,12,9],[3,9,4,9],[5,9,6,9]]}
[]
[]
[null,null,"Source of RE",null,"Power Market","Mode of compliance","Type of Plant","Non- Fossil Energy","TYPE OF CONTRACT","Source","Voltage level","Nature of Load",null,"Type of obligation(s) of Obligated Designated Consumer"]
[null,null,"Solar PV and solar thermal power",null,"Power Exchange","RE Own Generation","On Grid","RE Own Generation","Long Term","Thermal","400KV","Base Load",null,"Distribution licensee (DISCOM)"]
[null,null,"Wind Energy",null,"Bilateral ","RE Purchase","Off Grid","RE Purchase","Medium Term",null,"132KV","Seasonal Load",null,"Open Access(OA)"]
[null,null,"All Hydro Power including Large Hydro Projects (LHPs), Pumped Storage Projects (PSPs) and Small Hydro Projects (SHPs).",null,"N/A","REC",null,"REC","Short Term","Wind","220KV","Diurnal Load",null,"Captive power plant(CPP)"]
[null,null,"Wind Energy",null,null,"Energy Equivalent of Green Hydrogen consumed (in SCM)",null,"Energy Equivalent of Green Hydrogen consumed (in SCM)",null,null,"66KV"]
[null,null,"All Hydro Power including Large Hydro Projects (LHPs), Pumped Storage Projects (PSPs) and Small Hydro Projects (SHPs).",null,null,"Energy Equivalent of Green Ammonia consumed (in Tons)",null,"Energy Equivalent of Green Ammonia consumed (in Tons)",null,"Nuclear","33KV"]
[null,null,"Non-fossil fuel (including Bagasse) based co-generation projects.",null,null,null,null,null,null,null,"11KV"]
[null,null,"Biomass Power based on Rankine cycle and combined cycle technologies. ",null,null,null,null,null,null,"Small hydro"]
[null,null,"Biomass Gasifier based power. "]
[null,null,"Biogas based power. ",null,null,null,null,null,null,"Solar"]
[null,null,"Waste to Energy"]
[null,null,"Geothermal Power ",null,null,null,null,null,null,"Thermal"]
[null,null,"Tidal Power"]
[null,null,"Other hybrid technologies including renewable-renewable or renewable component of renewable-conventional sources for which renewable technology is approved by MNRE."]
[null,null,"Purchase of green hydrogen or green ammonia for use as energy and feedstock."]
[null,null,"Any other source as may be recognized or approved by Central Government / MNRE from time to time"]
[]
[]
{"$rows_left_out":4}
{"sheet":"Annexure-1","index":7,"n_rows":69,"n_cols":13,"rows_kept":69,"cut":false,"hidden":false,"merged":[[63,2,63,9],[58,2,58,9],[59,2,59,9],[55,2,55,9],[56,2,56,9],[57,2,57,9],[60,2,60,9],[61,2,61,9],[54,3,54,4],[2,2,2,9],[5,2,5,9],[35,2,35,9],[43,2,43,9],[19,2,19,9],[6,2,6,9],[54,5,54,7],[54,8,54,9]]}
[]
[]
[null,null,"Annexure – 1: Estimation of electricity generated from combustion of renewable sources, and from auxiliary firing of fossil fuel in WHR System"]
[]
[]
[null,null,"Step # 1: Estimation of electricity generated at Generator Terminal by combustion of Renewable Fuels [Er(GT)]"]
[null,null,"Case # 1: Estimation of renewable electrical energy generated from cofiring of multiple renewable fuels along with fossil fuels in the same boiler in CPP."]
[null,null,"Particulars ","Nomenclature","Unit","Quarter 1","Quarter 2","Quarter 3","Quarter 4","Annual",null,null,"Case 1 Schematic:"]
[null,null,"Electrical energy generated by other renewable sources at Generator terminal during the quarter","Er(G)1 = [((Qrsolid x Grsolid) + (Qrliq x Grliq) + (Qrgas x Grgas)) / ((Qf x Gf) + (Qrsolid x Grsolid) + (Qrliq x Grliq) + (Qrgas x Grgas))] x E(GT)1","MU",{"$f":"IF(((F17*F18)+(F11*F12)+(F13*F14)+(F15*F16))*F10=0,0,((F11*F12)+(F13*F14)+(F15*F16))/((F17*F18)+(F11*F12)+(F13*F14)+(F15*F16))*F10)","v":0},{"$f":"IF(((G17*G18)+(G11*G12)+(G13*G14)+(G15*G16))*G10=0,0,((G11*G12)+(G13*G14)+(G15*G16))/((G17*G18)+(G11*G12)+(G13*G14)+(G15*G16))*G10)","v":0},0,0,{"$f":"SUM(F9:I9)","v":0}]
[null,null,"Total electrical energy generated at Generator Terminal during the quarter ","E(GT)1","MU",null,null,null,null,{"$f":"SUM(F10:I10)","v":0}]
[null,null,"Quantity of other renewable sources (solid fuels) consumed during the quarter","Qrsolid"," kg",null,null,null,null,{"$f":"SUM(F11:I11)","v":0}]
[null,null,"Weighted average GCV of other renewable energy sources (solid fuels) during the quarter","Grsolid","kCal/kg"]
[null,null,"Quantity of other renewable sources (liquid fuels) consumed during the quarter","Qrliq"," kg",null,null,null,null,{"$f":"SUM(F13:I13)","v":0}]
[null,null,"Weighted average GCV of other renewable sources (liquid fuels) during the quarter","Grliq","kCal/kg"]
[null,null,"Quantity of other renewable sources (gaseous fuels) consumed during the quarter","Qrgas"," kg",null,null,null,null,{"$f":"SUM(F15:I15)","v":0}]
[null,null,"Weighted average GCV of other renewable sources (gaseous fuels) during the quarter","Grgas","kCal/kg"]
[null,null,"Quantity of coal or other fossil fuel burnt during the quarter","Qf"," kg",null,null,null,null,{"$f":"SUM(F17:I17)","v":0}]
[null,null,"Weighted average GCV of coal or other fossil fuel burnt during the quarter","Gf","kCal/kg"]
[]
[null,null,"Case # 2: Estimation of renewable electrical energy generated from cofiring of multiple renewable fuels (e.g., black liquor dry solids - BLDS) in separate boiler(s) and separate boiler(s) for fossil fuels and with these boilers feeding to a common turbine generator set for electricity generation"]
{"$rows_left_out":50}
{"sheet":"Annexure-2","index":8,"n_rows":26,"n_cols":19,"rows_kept":26,"cut":false,"hidden":false,"merged":[[1,1,1,8],[12,1,12,8],[14,3,14,7],[3,1,5,2],[11,10,11,18],[5,3,5,7],[4,3,4,7],[3,3,3,7],[7,1,8,1],[7,2,8,2],[7,8,8,8],[11,1,11,8],[14,13,14,17]]}
[]
[null,"Annexure – 2: Estimation of electricity required for production of Green Hydrogen"]
[]
[null,"Legend",null,"Data to be Entered by User"]
[null,null,null,"Data Entry Not Allowed"]
[null,null,null,"Calculated Data"]
[]
[null,"GrandTotal - Energy Equivalent of GH2 consumed (Case # 1 + Case # 2)","MU","Quarter 1","Quarter 2","Quarter 3","Quarter 4","Annual","Note: The Quarter wise Energy Equivalent of GH2 consumed is automatically reflected in the Form A of respective quarter."]
[null,null,null,{"$f":"D16+N16","v":0},{"$f":"E16+O16","v":0},0,0,{"$f":"SUM(D9:G9)","v":0}]
[]
[]
[null,"Case # 1: Electrolysis of Water - Estimation of electricity consumption for production of Green Hydrogen",null,null,null,null,null,null,null,null,"Case # 2: Gasification of Biomass - Estimation of energy consumption for production of Green Hydrogen"]
[null,"To calculate the electricity consumption for producing 1 kg of green hydrogen through the electrolysis process, the following formula shall be used:\nElectricity Consumption per kg of H2 (kWh) = Theoretical Energy Required (39.4 kWh/kg) / Efficiency of Electrolyzer"]
[null,"Particulars ","Unit","Quarter 1","Quarter 2","Quarter 3","Quarter 4","Annual","Remarks",null,"Particulars ","Nomenclature","Unit","Quarter 1","Quarter 2","Quarter 3","Quarter 4","Annual","Remarks"]
[null,"Theoretical Energy Required per kg of H2 (kWh/kg): ","kWh/kg (theoretical)",39.4,null,null,null,null,null,null,"1 kilowatthour (kWh) = 3.6 megajoules(MJ)","-","kWh/MJ ",{"$f":"1/3.6","v":0.27777777777777779}]
[null,"SubTotal of Electrolyzers - Energy Equivalent of GH2 produced / purchased","MU",{"$f":"SUM(_xlfn._xlws.FILTER(Electrolyzers[Quarter 1],Electrolyzers[Particulars]=\"Energy Equivalent of GH2 consumed\",0))","v":0},{"$f":"SUM(_xlfn._xlws.FILTER(Electrolyzers[Quarter 2],Electrolyzers[Particulars]=\"Energy Equivalent of GH2 consumed\",0))","v":0},{"$f":"SUM(_xlfn._xlws.FILTER(Electrolyzers[Quarter 3],Electrolyzers[Particulars]=\"Energy Equivalent of GH2 consumed\",0))","v":0},{"$f":"SUM(_xlfn._xlws.FILTER(Electrolyzers[Quarter 4],Electrolyzers[Particulars]=\"Energy Equivalent of GH2 consumed\",0))","v":0},{"$f":"SUM(_xlfn._xlws.FILTER(Electrolyzers[Annual],Electrolyzers[Particulars]=\"Energy Equivalent of GH2 consumed\",0))","v":0},"-",null,"SubTotal of Biomass Gassification - Energy Equivalent of GH2 produced / purchased",null,"MU",{"$f":"SUM(_xlfn._xlws.FILTER(Gassification[Quarter 1],Gassification[[Particulars ]]=\"Energy Equivalent of GH2 consumed\",0))","v":0},{"$f":"SUM(_xlfn._xlws.FILTER(Gassification[Quarter 2],Gassification[Nomenclature]=\"Energy Equivalent of GH2 consumed\",0))","v":0},{"$f":"SUM(_xlfn._xlws.FILTER(Gassification[Quarter 3],Gassification[Unit]=\"Energy Equivalent of GH2 consumed\",0))","v":0},{"$f":"SUM(_xlfn._xlws.FILTER(Gassification[Quarter 4],Gassification[Quarter 1]=\"Energy Equivalent of GH2 consumed\",0))","v":0},{"$f":"SUM(_xlfn._xlws.FILTER(Gassification[Annual],Gassification[Quarter 2]=\"Energy Equivalent of GH2 consumed\",0))","v":0},"-"]
[]
[null,"Particulars","Unit","Quarter 1","Quarter 2","Quarter 3","Quarter 4","Annual","Remarks",null,"Particulars ","Nomenclature","Unit","Quarter 1","Quarter 2","Quarter 3","Quarter 4","Annual","Remarks"]
[null,"Electrolyzer 1:",null,null,null,null,null,null,"To add rows for additional Electrolysers at the end of this table, or to remove rows for additional Electrolysers, please use the respective command buttons provided above",null,"Biomass_Gassification 1:",null,null,null,null,null,null,null,"To add rows for additional Biomass Gassifiers at the end of this table, or to remove rows for Biomass Gassifiers, please use the respective command buttons provided above"]
[null,"Electrolyzer Efficiency:","%",null,null,null,null,null,"The efficiency of the electrolyzer typically ranges from 60% to 80%. ",null,"Energy Required per kg of H2","E = C / (Y * η)"," MJ/kg H₂",{"$f":"IF(N22*N23=0,0,N21/(N22*N23))","v":0},{"$f":"IF(O22*O23=0,0,O21/(O22*O23))","v":0},0,0,{"$f":"SUM(Gassification[[#This Row],[Quarter 1]:[Quarter 4]])","v":0}]
{"$rows_left_out":7}
{"sheet":"StateUTs","index":9,"n_rows":37,"n_cols":7,"rows_kept":37,"cut":false,"hidden":true,"merged":[]}
["Sl No.","State/ UT","State category"]
[35,"Andaman and Nicobar Island","Normal",null,null,"Target Quarter","Type of obligation(s) of Obligated Designated Consumer#"]
[1,"Andhra Pradesh","Normal",null,null,"Q1","Discom"]
[2,"Arunachal Pradesh","NER",null,null,"Q2","Captive Power Plant(CPP)"]
[3,"Assam","NER",null,null,"Q3","Open Access"]
[4,"Bihar","Normal",null,null,"Q4"]
[32,"Chandigarh","Normal"]
[5,"Chhattisgarh","Normal"]
[33,"Daman & Diu and Dadra & Nagar Haveli","Normal"]
[6,"Delhi","Normal"]
[7,"Goa","Normal"]
[8,"Gujarat","Normal"]
[9,"Haryana","Normal"]
[10,"Himachal Pradesh","Hilly"]
[11,"Jammu & Kashmir","Hilly"]
[13,"Jharkhand","Normal"]
[14,"Karnataka","Normal"]
[15,"Kerala","Normal"]
[12,"Ladakh","Hilly"]
[36,"Lakshadweep","Normal"]
{"$rows_left_out":18}
{"sheet":"Targets","index":10,"n_rows":20,"n_cols":8,"rows_kept":20,"cut":false,"hidden":true,"merged":[]}
[null,null,null,"Wind RE","Hydro RE","Distributed RE","Other RE","Total"]
[null,"State category","FY","Wind renewable energy","Hydro renewable energy","Distributed renewable energy*","Other renewable energy","Total renewable energy"]
[null,"Normal","2024-25",6.7000000000000002E-3,3.8E-3,1.4999999999999999E-2,0.27350000000000002,0.29909999999999998]
[null,"Normal","2025-26",1.4500000000000001E-2,1.2200000000000001E-2,2.1000000000000001E-2,0.28239999999999998,0.3301]
[null,"Normal","2026-27",1.9699999999999999E-2,1.34E-2,2.7E-2,0.2994,0.35949999999999999]
[null,"Normal","2027-28",2.4500000000000001E-2,1.4200000000000001E-2,3.3000000000000002E-2,0.31640000000000001,0.3881]
[null,"Normal","2028-29",2.9499999999999998E-2,1.4200000000000001E-2,3.9E-2,0.33100000000000002,0.41360000000000002]
[null,"Normal","2029-30",3.4799999999999998E-2,1.3299999999999999E-2,4.4999999999999998E-2,0.3402,0.43330000000000002]
[null,"Hilly","2024-25",6.7000000000000002E-3,3.8E-3,7.4999999999999997E-3,0.28100000000000003,0.29909999999999998]
[null,"Hilly","2025-26",1.4500000000000001E-2,1.2200000000000001E-2,1.0500000000000001E-2,0.29289999999999999,0.3301]
[null,"Hilly","2026-27",1.9699999999999999E-2,1.34E-2,1.35E-2,0.31290000000000001,0.35949999999999999]
[null,"Hilly","2027-28",2.4500000000000001E-2,1.4200000000000001E-2,1.6500000000000001E-2,0.33290000000000003,0.3881]
[null,"Hilly","2028-29",2.9499999999999998E-2,1.4200000000000001E-2,1.95E-2,0.35050000000000003,0.41360000000000002]
[null,"Hilly","2029-30",3.4799999999999998E-2,1.3299999999999999E-2,2.2499999999999999E-2,0.36270000000000002,0.43330000000000002]
[null,"NER","2024-25",6.7000000000000002E-3,3.8E-3,7.4999999999999997E-3,0.28100000000000003,0.29909999999999998]
[null,"NER","2025-26",1.4500000000000001E-2,1.2200000000000001E-2,1.0500000000000001E-2,0.29289999999999999,0.3301]
[null,"NER","2026-27",1.9699999999999999E-2,1.34E-2,1.35E-2,0.31290000000000001,0.35949999999999999]
[null,"NER","2027-28",2.4500000000000001E-2,1.4200000000000001E-2,1.6500000000000001E-2,0.33290000000000003,0.3881]
[null,"NER","2028-29",2.9499999999999998E-2,1.4200000000000001E-2,1.95E-2,0.35050000000000003,0.41360000000000002]
[null,"NER","2029-30",3.4799999999999998E-2,1.3299999999999999E-2,2.2499999999999999E-2,0.36270000000000002,0.43330000000000002]